build.py...
: error C0DE: Unknown fatal error when processing [/data/sandcastle/boxes/aosp/non-hlos/niobe/BOOT.MXF.2.5.2/boot_images/boot/QcomPkg/SocPkg/Matrix/LAA/Core.dsc]
(Please send email to devel@edk2.groups.io for help, attaching following call stack trace!)
(Python 3.10.3 on linux) Traceback (most recent call last):
File "/data/sandcastle/boxes/aosp/non-hlos/niobe/BOOT.MXF.2.5.2/boot_images/edk2/BaseTools/Source/Python/build/build.py", line 2695, in Main
MyBuild.Launch()
File "/data/sandcastle/boxes/aosp/non-hlos/niobe/BOOT.MXF.2.5.2/boot_images/edk2/BaseTools/Source/Python/build/build.py", line 2490, in Launch
self._MultiThreadBuildPlatform()
File "/data/sandcastle/boxes/aosp/non-hlos/niobe/BOOT.MXF.2.5.2/boot_images/edk2/BaseTools/Source/Python/build/build.py", line 2282, in _MultiThreadBuildPlatform
Wa, self.BuildModules = self.PerformAutoGen(BuildTarget,ToolChain)
File "/data/sandcastle/boxes/aosp/non-hlos/niobe/BOOT.MXF.2.5.2/boot_images/edk2/BaseTools/Source/Python/build/build.py", line 2133, in PerformAutoGen
Wa = WorkspaceAutoGen(
File "/data/sandcastle/boxes/aosp/non-hlos/niobe/BOOT.MXF.2.5.2/boot_images/edk2/BaseTools/Source/Python/AutoGen/WorkspaceAutoGen.py", line 43, in __init__
self._InitWorker(Workspace, MetaFile, Target, Toolchain, Arch, *args, **kwargs)
File "/data/sandcastle/boxes/aosp/non-hlos/niobe/BOOT.MXF.2.5.2/boot_images/edk2/BaseTools/Source/Python/AutoGen/WorkspaceAutoGen.py", line 116, in _InitWorker
self.ProcessModuleFromPdf()
File "/data/sandcastle/boxes/aosp/non-hlos/niobe/BOOT.MXF.2.5.2/boot_images/edk2/BaseTools/Source/Python/AutoGen/WorkspaceAutoGen.py", line 212, in ProcessModuleFromPdf
if self.FdfProfile:
File "/data/sandcastle/boxes/aosp/non-hlos/niobe/BOOT.MXF.2.5.2/boot_images/edk2/BaseTools/Source/Python/Common/caching.py", line 28, in __get__
Value = obj.__dict__[self._function.__name__] = self._function(obj)
File "/data/sandcastle/boxes/aosp/non-hlos/niobe/BOOT.MXF.2.5.2/boot_images/edk2/BaseTools/Source/Python/AutoGen/WorkspaceAutoGen.py", line 188, in FdfProfile
Fdf.ParseFile()
File "/data/sandcastle/boxes/aosp/non-hlos/niobe/BOOT.MXF.2.5.2/boot_images/edk2/BaseTools/Source/Python/GenFds/FdfParser.py", line 1315, in ParseFile
self.Preprocess()
File "/data/sandcastle/boxes/aosp/non-hlos/niobe/BOOT.MXF.2.5.2/boot_images/edk2/BaseTools/Source/Python/GenFds/FdfParser.py", line 1294, in Preprocess
self.PreprocessIncludeFile()
File "/data/sandcastle/boxes/aosp/non-hlos/niobe/BOOT.MXF.2.5.2/boot_images/edk2/BaseTools/Source/Python/GenFds/FdfParser.py", line 625, in PreprocessIncludeFile
raise Warning("The include file does not exist under below directories: \n%s\n%s\n%s\n"%(os.path.dirname(self.FileName), PlatformDir, GlobalData.gWorkspace),
GenFds.FdfParser.Warning: The include file does not exist under below directories:
/data/sandcastle/boxes/aosp/non-hlos/niobe/BOOT.MXF.2.5.2/boot_images/boot/QcomPkg/SocPkg/Matrix/LAA
/data/sandcastle/boxes/aosp/non-hlos/niobe/BOOT.MXF.2.5.2/boot_images/boot/QcomPkg/SocPkg/Matrix/LAA
/data/sandcastle/boxes/aosp/non-hlos/niobe/BOOT.MXF.2.5.2/boot_images/boot
near line 272, column 0: !include QcomPkg/SocPkg/Matrix/devices/$(TARGET_DEVICE)/boot/QcomPkg/SocPkg/Matrix/Common/Panel.fdf
- Failed -
Build end time: 16:48:12, Mar.04 2025
Build total time: 00:00:01
[buildex.py] ERROR: Run ['python', '/data/sandcastle/boxes/aosp/non-hlos/niobe/BOOT.MXF.2.5.2/boot_images/edk2/BaseTools/Source/Python/build/build.py', '-p', 'QcomPkg/SocPkg/Matrix/LAA/Core.dsc', '-j', '/data/sandcastle/boxes/aosp/non-hlos/niobe/BOOT.MXF.2.5.2/boot_images/BuildLogs/Matrix_LAA_build_Core_RELEASE.log',
'-w', '-a', 'AARCH64', '-b', 'RELEASE', '-y', 'XBLCore_build_report.txt', '-t', 'CLANG160LINUX', '-D', 'BUILDROOT=/data/sandcastle/boxes/aosp/non-hlos/niobe/BOOT.MXF.2.5.2/boot_images', '-D', 'BOOTROOT=/data/sandcastle/boxes/aosp/non-hlos/niobe/BOOT.MXF.2.5.2/boot_images/boot',
'-D', 'REL=RELEASE', '-D', 'PRODMODE=PRODMODE', '-D', 'VAR=LAA', '-D', 'COMPLIER=', '-D', 'FIRSTDLL=', '-D', 'SECONDDLL=', '-D', 'XBLSEC=', '-D', 'TARGETROOT=QcomPkg/SocPkg/Matrix', '-D', 'TARGETID=SocMatrix', '-D', 'TARGETPKG=SocPkg', '-D', 'QCOMDIR=', '-D',
'LOGDIR=/data/sandcastle/boxes/aosp/non-hlos/niobe/BOOT.MXF.2.5.2/boot_images/BuildLogs', '-D', 'BOOTTOOLS=/data/sandcastle/boxes/aosp/non-hlos/niobe/BOOT.MXF.2.5.2/boot_images/boot_tools', '-D', 'EDK2ROOT=/data/sandcastle/boxes/aosp/non-hlos/niobe/BOOT.MXF.2.5.2/boot_images/edk2',
'-D', 'CLANG160=%LLVM_ROOT%/16.0.7.0/bin', '-D', 'DTC=%DTC_PATH%', '-D', 'SECTOOLSROOT=/data/sandcastle/boxes/aosp/non-hlos/niobe/Matrix.LA.1.0/common/sectoolsv2/ext/Linux', '-D', 'TARGET_DEVICE=segundo', '-D', 'COMPILER=CLANG160LINUX', '-D', 'AARCH=AARCH64']
Build Subprocess failed with error...
None
make: *** [Makefile:235: /data/sandcastle/boxes/aosp/non-hlos/niobe/.build/.boot] Error 255